{"text_format":"3","workbook":"xlsx","n_sheets":13,"sheets":["1. Intro","2. Critères","3. Conformité","4. Tableau récap","5. Tab détaillé","6. Avantage offre","7. Not prix","8. Aide not Q1-5","9. Aide not Q6-9","10. Aide not R5-9","11. Aide not R13-14","12. Critère concordance","13. Liste critères"],"not_rendered":{"images":15,"defined_names":66,"comments":5},"read":"whole","date_system":"1900"}

{"sheet":"1. Intro","index":0,"n_rows":24,"n_cols":1,"rows_kept":24,"merged":[[1,0,1,6],[3,0,3,10],[5,0,5,10],[7,0,7,10],[8,0,8,10],[9,0,9,10],[10,0,10,10],[11,0,11,10],[12,0,12,10],[13,0,13,10],[14,0,14,10],[15,0,15,10],[16,0,16,10],[17,0,17,10],[18,0,18,10],[19,0,19,10],[21,0,21,10],[23,0,23,10]]}
[]
["Marchés publics : les critères et leur évaluation"]
[]
["Cet outil se propose d'aider les responsables d'appels d'offres dans le choix des critères d'adjudication et de les accompagner jusqu'au stade de leur évaluation."]
[]
["Ce fichier contient les onglets suivants :"]
[]
["1. Intro : Marchés publics : les critères et leur évaluation"]
["2. Critères : Critères et pondération"]
["3. Conformité : Conformité du dossier d'appel d'offres"]
["4. Tableau récap : Tableau récapitulatif d'évaluation des offres"]
["5. Tab détaillé : Tableau détaillé d'évaluation des offres"]
["6. Avantage offre : Caractéristiques et avantages décisifs de l'offre retenue"]
["7. Not prix : Méthode de notation du prix"]
["8. Aide not Q1-5 : Annexe Q Critères d'aptitude* / Aide notes Q1 à Q5"]
["9. Aide not Q6-9 : Annexe Q Critères d'aptitude* / Aide notes Q6 à Q9"]
["10. Aide not R5-9 : Annexe R Critères d'adjudication* / Aide notes R5 à R9"]
["11. Aide not R13-14 : Annexe R Critères d'adjudication* / Aide notes R13 à R14"]
["12. Critère concordance : Critère qualité technique de l'offre - sous-critère concordance des prix"]
["13. Liste critères : Liste des critères"]
[]
["Les onglets de couleur jaune doivent impérativement être complétés par la personne en charge de l'évaluation des offres."]
[]
["Les liens vers les annexes du Guide romand pour les marchés publics se trouvent dans l'onglet \"13. Liste critères\"."]

{"sheet":"2. Critères","index":1,"n_rows":24,"n_cols":8,"rows_kept":24,"merged":[[1,0,1,6],[3,0,3,6],[4,0,4,1],[4,2,4,6],[5,0,5,1],[5,2,5,6],[6,0,6,1],[6,2,6,6],[7,0,8,1],[7,2,8,2],[7,3,8,3],[7,4,7,6],[7,7,8,7],[10,0,13,0],[10,1,13,1],[10,4,13,4],[10,5,13,5],[10,6,13,6],[10,7,15,7],[14,0,16,0],[14,1,16,1],[14,4,15,4],[14,5,15,5],[14,6,15,6],[17,0,21,0],[17,1,21,1],[17,4,21,4],[17,5,21,5],[17,6,21,6],[17,7,22,7],[23,0,23,2]]}
[]
["Critères et pondération"]
[]
["CHOIX DES CRITERES PAR RAPPORT AU TYPE DE PROCEDURE :"]
["SUR INVITATION :",null,"Les critères de 1 à 4 sont utilisés dans tous les cas"]
["OUVERTE :",null,"La totalité des critères de 1 à 5 est utilisée selon les exigences de l'ouvrage"]
["SELECTIVE :",null,"Les critères 4 et 5 sont utilisés en phase de présélection. Pour la deuxième phase la totalité des critères peut être utilisée"]
["CRITERES",null,"DESCRIPTIF","DOCUMENTATION REQUISE ou MOYENS D'ANALYSE","Pondération des critères (en %)",null,null,"Liens"]
[{"$nulls":4},"Travaux courants sans exigences particulières","Travaux à exigences qualitatives moyennes","Travaux à hautes exigences qualitatives"]
[1,"Prix","La méthode de notation du prix pour les marchés de construction et de fourniture est celle adoptée par la Municipalité le 06.10.2010","Série de prix","70\n(+/-10)","60\n(+/-10)","50\n(+/-10)","Onglet 7. Not prix"]
[2,"Organisation pour l'exécution du marché","Nombre, planification et disponibilité des moyens et des ressources pour l'exécution du marché","Annexe R6*","8\n(+/- 3)","10\n(+/- 5)","15\n(+/- 10)","Onglets :\n10. Aide not R5-9\n11. Aide not R13-14"]
[null,null,"Méthodes de travail pour atteindre les objectifs fixés en matière d’exécution du marché","Annexe R7*"]
[null,null,"Répartition des tâches et des responsabilités pour l’exécution du marché","Annexe R8*"]
[null,null,"Qualifications des personnes-clés désignées pour l'exécution du marché","Annexe R9*"]
[3,"Qualités techniques de l'offre","Qualités des solutions techniques proposées pour l'exécution du marché ","Annexe R13*","8\n(+/-3)","12\n(+/-8)","13\n(+/-10)"]
[null,null,"Degré de compréhension du cahier des charges et des prestations à exécuter","Annexe R14*"]
[null,null,"Analyse de sensibilité des prix unitaires dans le but d'évaluer et pénaliser la spéculation","Série de prix",{"$nulls":3},"Onglet 12. Critère concordance"]
[4,"Organisation du soumissionnaire","Organisation qualité du soumissionnaire pour satisfaire les exigences du client","Annexe Q1*","8\n(+/-3)","10\n(+/-5)","12\n(+/-8)","Onglets :\n8. Aide not Q1-5\n9. Aide not Q6-9"]
[null,null,"Organisation interne du soumissionnaire","Annexe Q2*"]
[null,null,"Concept santé et sécurité au travail de l’entreprise","Annexe Q3*"]
[null,null,"Capacité en personnel et formation de base des personnes-clés","Annexe Q4*"]
[null,null,"Contribution de l'entreprise au développement durable (aspects environnementaux et sociaux)","Annexe Q5*"]
[5,"Références","Références de travaux de construction","Annexe Q9*","6\n(+/-2)","8\n(+/-3)","10\n(+/-5)"]
["*Annexes du Guide romand pour les marchés publics disponibles sur le site Internet officiel de l’État de Vaud"]

{"sheet":"3. Conformité","index":2,"n_rows":31,"n_cols":6,"rows_kept":31,"merged":[[1,0,1,5],[26,1,26,5],[27,0,27,2]]}
[]
["Conformité du dossier d'appel d'offres\nCheck-list"]
[]
["AFFAIRE : …"]
["PROCÉDURE : …"]
["MARCHÉ : …"]
[]
["Eléments à contrôler (OUI/NON) :","Nom soumissionnaire 1","Nom soumissionnaire 2","Nom soumissionnaire 3","Nom soumissionnaire 4","Nom soumissionnaire 5"]
["1. L’offre a été rendue dans les délais fixés"]
["2. L’offre est datée, signée et remise dans le format adéquat"]
["3. Les attestations de paiement des charges sociales ont été remises :"]
["n attestation du paiement des charges sociales 1er pilier"]
["n attestation du paiement des charges sociales 2ème pilier"]
["n attestation du paiement des impôts à la source"]
["n attestation du paiement des charges sociales du·des sous-traitant·s"]
["4. Le chapitre et l'annexe sur la sous-traitance ont été complétés conformément au dossier d’appel d’offres"]
["5. La série de prix et la page récapitulative ont été entièrement remplies"]
["6. Le tableau pour le calcul des variations de prix a été complété"]
["7. L'annexe sur les cartes professionnelles a été complétée et signée"]
["8. Le dossier d’appel d’offres n’a pas été modifié"]
["9. Suite au contrôle arithmétique de la soumission, le contenu est cohérent (calculs, prix unitaires, etc.)"]
["10. L'annexe Q… est complétée et rendue"]
["11. L'annexe R… est complétée et rendue"]
["…"]
["…"]
["…"]
["Remarques :","…"]
["*Annexes du Guide romand pour les marchés publics disponibles sur le site Internet officiel de l’État de Vaud"]
[]
["OUI"]
["NON"]

{"sheet":"4. Tableau récap","index":3,"n_rows":20,"n_cols":13,"rows_kept":20,"merged":[[1,0,1,11],[3,0,3,1],[3,2,4,3],[3,4,4,5],[3,6,4,7],[3,8,4,9],[3,10,4,11],[4,0,4,1],[5,0,5,1],[5,2,5,3],[5,4,5,5],[5,6,5,7],[5,8,5,9],[5,10,5,11],[6,0,6,1],[6,2,6,3],[6,4,6,5],[6,6,6,7],[6,8,6,9],[6,10,6,11],[8,12,13,12],[15,2,15,3],[15,4,15,5],[15,6,15,7],[15,8,15,9],[15,10,15,11],[16,2,16,11]]}
[]
["Tableau récapitulatif d'évaluation des offres"]
[]
["Objet : …",null,"Nom soumissionnaire 1\nSiège social",null,"Nom soumissionnaire 2\nSiège social",null,"Nom soumissionnaire 3\nSiège social",null,"Nom soumissionnaire 4\nSiège social",null,"Nom soumissionnaire 5\nSiège social"]
["CFC : …"]
["Montants arrêtés TTC"]
["Ecart en %",null,{"v":1,"d":"100.0%"},null,{"$f":"IF(E6>0,E6/$C$6,\"\")","v":""},null,{"$f":"IF(G6>0,G6/$C$6,\"\")","v":""},null,{"$f":"IF(I6>0,I6/$C$6,\"\")","v":""},null,{"$f":"IF(K6>0,K6/$C$6,\"\")","v":""},null,"Liens"]
["Critères\nv. onglet \"2. Critères\"","Pondération\nv. onglet \"2. Critères\"","Note\nv. Annexe T1*","Note pondérée","Note","Note pondérée","Note","Note pondérée","Note","Note pondérée","Note","Note pondérée","Annexe T1 Echelle des notes de 0 à 5*"]
["Prix",null,{"$f":"IF(ISBLANK(C6),\"\",(5*(2*$C$6-C6)/(2*$C$6-$C$6)))","v":""},{"$f":"IF(C$6>0,C9*$B9/100,\"\")","v":""},{"$f":"IF(ISBLANK(E6),\"\",(5*(2*$C$6-E6)/(2*$C$6-$C$6)))","v":""},{"$f":"IF(E$6>0,E9*$B9/100,\"\")","v":""},{"$f":"IF(ISBLANK(G6),\"\",(5*(2*$C$6-G6)/(2*$C$6-$C$6)))","v":""},{"$f":"IF(G$6>0,G9*$B9/100,\"\")","v":""},{"$f":"IF(ISBLANK(I6),\"\",(5*(2*$C$6-I6)/(2*$C$6-$C$6)))","v":""},{"$f":"IF(I$6>0,I9*$B9/100,\"\")","v":""},{"$f":"IF(ISBLANK(K6),\"\",(5*(2*$C$6-K6)/(2*$C$6-$C$6)))","v":""},{"$f":"IF(K$6>0,K9*$B9/100,\"\")","v":""},"Onglet 2. Critères"]
["Organisation pour l'exécution du marché",null,{"$f":"IF(C$6>0,'5. Tab détaillé'!E14,\"\")","v":""},{"$f":"IF(C10=\"\",\"\",$B10*C10/100)","v":""},{"$f":"IF(E$6>0,'5. Tab détaillé'!G14,\"\")","v":""},{"$f":"IF(E10=\"\",\"\",$B10*E10/100)","v":""},{"$f":"IF(G$6>0,'5. Tab détaillé'!I14,\"\")","v":""},{"$f":"IF(G10=\"\",\"\",$B10*G10/100)","v":""},{"$f":"IF(I$6>0,'5. Tab détaillé'!K14,\"\")","v":""},{"$f":"IF(I10=\"\",\"\",$B10*I10/100)","v":""},{"$f":"IF(K$6>0,'5. Tab détaillé'!M14,\"\")","v":""},{"$f":"IF(K10=\"\",\"\",$B10*K10/100)","v":""}]
["Qualités techniques de l'offre",null,{"$f":"IF(C$6>0,'5. Tab détaillé'!E19,\"\")","v":""},{"$f":"IF(C11=\"\",\"\",$B11*C11/100)","v":""},{"$f":"IF(E$6>0,'5. Tab détaillé'!G19,\"\")","v":""},{"$f":"IF(E11=\"\",\"\",$B11*E11/100)","v":""},{"$f":"IF(G$6>0,'5. Tab détaillé'!I19,\"\")","v":""},{"$f":"IF(G11=\"\",\"\",$B11*G11/100)","v":""},{"$f":"IF(I$6>0,'5. Tab détaillé'!K19,\"\")","v":""},{"$f":"IF(I11=\"\",\"\",$B11*I11/100)","v":""},{"$f":"IF(K$6>0,'5. Tab détaillé'!M19,\"\")","v":""},{"$f":"IF(K11=\"\",\"\",$B11*K11/100)","v":""}]
["Organisation du soumissionnaire",null,{"$f":"IF(C$6>0,'5. Tab détaillé'!E26,\"\")","v":""},{"$f":"IF(C12=\"\",\"\",$B12*C12/100)","v":""},{"$f":"IF(E$6>0,'5. Tab détaillé'!G26,\"\")","v":""},{"$f":"IF(E12=\"\",\"\",$B12*E12/100)","v":""},{"$f":"IF(G$6>0,'5. Tab détaillé'!I26,\"\")","v":""},{"$f":"IF(G12=\"\",\"\",$B12*G12/100)","v":""},{"$f":"IF(I$6>0,'5. Tab détaillé'!K26,\"\")","v":""},{"$f":"IF(I12=\"\",\"\",$B12*I12/100)","v":""},{"$f":"IF(K$6>0,'5. Tab détaillé'!M26,\"\")","v":""},{"$f":"IF(K12=\"\",\"\",$B12*K12/100)","v":""}]
["Références",null,{"$f":"IF(C$6>0,'5. Tab détaillé'!E29,\"\")","v":""},{"$f":"IF(C13=\"\",\"\",$B13*C13/100)","v":""},{"$f":"IF(E$6>0,'5. Tab détaillé'!G29,\"\")","v":""},{"$f":"IF(E13=\"\",\"\",$B13*E13/100)","v":""},{"$f":"IF(G$6>0,'5. Tab détaillé'!I29,\"\")","v":""},{"$f":"IF(G13=\"\",\"\",$B13*G13/100)","v":""},{"$f":"IF(I$6>0,'5. Tab détaillé'!K29,\"\")","v":""},{"$f":"IF(I13=\"\",\"\",$B13*I13/100)","v":""},{"$f":"IF(K$6>0,'5. Tab détaillé'!M29,\"\")","v":""},{"$f":"IF(K13=\"\",\"\",$B13*K13/100)","v":""}]
["…",null,{"$f":"IF(C$6>0,'5. Tab détaillé'!E30,\"\")","v":""},{"$f":"IF(C14=\"\",\"\",$B14*C14/100)","v":""},{"$f":"IF(E$6>0,'5. Tab détaillé'!G30,\"\")","v":""},{"$f":"IF(E14=\"\",\"\",$B14*E14/100)","v":""},{"$f":"IF(G$6>0,'5. Tab détaillé'!I30,\"\")","v":""},{"$f":"IF(G14=\"\",\"\",$B14*G14/100)","v":""},{"$f":"IF(I$6>0,'5. Tab détaillé'!K30,\"\")","v":""},{"$f":"IF(I14=\"\",\"\",$B14*I14/100)","v":""},{"$f":"IF(K$6>0,'5. Tab détaillé'!M30,\"\")","v":""},{"$f":"IF(K14=\"\",\"\",$B14*K14/100)","v":""}]
["Totaux notes pondérées",{"$f":"IF(SUM(B9:B14)<>100,\"ERREUR si <>100 !\",SUM(B9:B14))","v":"ERREUR si <>100 !"},null,{"$f":"SUM(D9:D13)","v":{"v":0,"d":"0.00"}},null,{"$f":"SUM(F9:F13)","v":{"v":0,"d":"0.00"}},null,{"$f":"SUM(H9:H13)","v":{"v":0,"d":"0.00"}},null,{"$f":"SUM(J9:J13)","v":{"v":0,"d":"0.00"}},null,{"$f":"SUM(L9:L13)","v":{"v":0,"d":"0.00"}}]
["Classement",null,{"$f":"RANK(D15,$D15:$L15)","v":1},null,{"$f":"RANK(F15,$C15:$L15)","v":1},null,{"$f":"RANK(H15,$C15:$L15)","v":1},null,{"$f":"RANK(J15,$C15:$L15)","v":1},null,{"$f":"RANK(L15,$C15:$L15)","v":1}]
[null,null,"*Annexe du Guide romand pour les marchés publics disponibles sur le site Internet officiel de l’État de Vaud"]
["Noms, prénoms :"]
["Signatures :"]
["Date :"]

{"sheet":"5. Tab détaillé","index":4,"n_rows":36,"n_cols":15,"rows_kept":36,"merged":[[1,0,1,13],[3,0,3,3],[3,4,4,5],[3,6,4,7],[3,8,4,9],[3,10,4,11],[3,12,4,13],[4,0,4,3],[13,0,13,1],[18,0,18,1],[25,0,25,1],[28,0,28,1],[31,0,31,1],[32,2,32,13]]}
[]
["Tableau détaillé d'évaluation des offres"]
[]
[{"$f":"'4. Tableau récap'!A4","v":"Objet : …"},{"$nulls":3},{"$f":"'4. Tableau récap'!C4","v":"Nom soumissionnaire 1\nSiège social"},null,{"$f":"'4. Tableau récap'!E4","v":"Nom soumissionnaire 2\nSiège social"},null,{"$f":"'4. Tableau récap'!G4","v":"Nom soumissionnaire 3\nSiège social"},null,{"$f":"'4. Tableau récap'!I4","v":"Nom soumissionnaire 4\nSiège social"},null,{"$f":"'4. Tableau récap'!K4","v":"Nom soumissionnaire 5\nSiège social"},null,"Liens"]
[{"$f":"'4. Tableau récap'!A5","v":"CFC : …"},{"$nulls":13},"Onglet 2. Critères"]
["Critères\nv. onglet \"2. Critères\"","Sous-critères","Annexes*","Pondération\nv. onglet \"2. Critères\"","Note\nv. Annexe T1*","Note pondérée","Note","Note pondérée","Note","Note pondérée","Note","Note pondérée","Note","Note pondérée","Annexe T1 Echelle des notes de 0 à 5*"]
["Organisation pour l'exécution du marché","Nombre de personnes","R6*",null,null,{"$f":"IF(E7>0,E7*D7/100*D$14/100,\"\")","v":""},null,{"$f":"IF(G7>0,G7*$D7/100*D$14/100,\"\")","v":""},null,{"$f":"IF(I7>0,I7*$D7/100*D$14/100,\"\")","v":""},null,{"$f":"IF(K7>0,K7*$D7/100*D$14/100,\"\")","v":""},null,{"$f":"IF(M7>0,M7*$D7/100*D$14/100,\"\")","v":""}]
[null,"Matériel mis à disposition","R6*",null,null,{"$f":"IF(E8>0,E8*D8/100*D$14/100,\"\")","v":""},null,{"$f":"IF(G8>0,G8*$D8/100*D$14/100,\"\")","v":""},null,{"$f":"IF(I8>0,I8*$D8/100*D$14/100,\"\")","v":""},null,{"$f":"IF(K8>0,K8*$D8/100*D$14/100,\"\")","v":""},null,{"$f":"IF(M8>0,M8*$D8/100*D$14/100,\"\")","v":""}]
[null,"Planning","R6*",null,null,{"$f":"IF(E9>0,E9*D9/100*D$14/100,\"\")","v":""},null,{"$f":"IF(G9>0,G9*$D9/100*D$14/100,\"\")","v":""},null,{"$f":"IF(I9>0,I9*$D9/100*D$14/100,\"\")","v":""},null,{"$f":"IF(K9>0,K9*$D9/100*D$14/100,\"\")","v":""},null,{"$f":"IF(M9>0,M9*$D9/100*D$14/100,\"\")","v":""}]
[null,"Méthodes","R7*",null,null,{"$f":"IF(E10>0,E10*D10/100*D$14/100,\"\")","v":""},null,{"$f":"IF(G10>0,G10*$D10/100*D$14/100,\"\")","v":""},null,{"$f":"IF(I10>0,I10*$D10/100*D$14/100,\"\")","v":""},null,{"$f":"IF(K10>0,K10*$D10/100*D$14/100,\"\")","v":""},null,{"$f":"IF(M10>0,M10*$D10/100*D$14/100,\"\")","v":""}]
[null,"Tâches et responsabilités","R8*"]
[null,"Qualification des personnes clés","R9*",null,null,{"$f":"IF(E12>0,E12*D12/100*D$14/100,\"\")","v":""},null,{"$f":"IF(G12>0,G12*$D12/100*D$14/100,\"\")","v":""},null,{"$f":"IF(I12>0,I12*$D12/100*D$14/100,\"\")","v":""},null,{"$f":"IF(K12>0,K12*$D12/100*D$14/100,\"\")","v":""},null,{"$f":"IF(M12>0,M12*$D12/100*D$14/100,\"\")","v":""}]
[null,"TOTAL DU SOUS CRITÈRE (100%)",null,{"$f":"IF(SUM(D7:D12)<>100,\"ERREUR\",SUM(D7:D12))","v":"ERREUR"},null,{"$f":"IF(E13>0,E13*D13/100*D$14/100,\"\")","v":""},null,{"$f":"IF(G13>0,G13*$D13/100*D$14/100,\"\")","v":""},null,{"$f":"IF(I13>0,I13*$D13/100*D$14/100,\"\")","v":""},null,{"$f":"IF(K13>0,K13*$D13/100*D$14/100,\"\")","v":""},null,{"$f":"IF(M13>0,M13*$D13/100*D$14/100,\"\")","v":""}]
["Total critère tableau d'évaluation",null,null,{"$f":"'4. Tableau récap'!B10","v":{"v":0,"d":"0 %"}},{"$f":"IF(($D14=0),\"\",(F14/$D14)*100)","v":""},{"$f":"SUM(F7:F13)","v":{"v":0,"d":"0.00"}},{"$f":"IF(($D14=0),\"\",(H14/$D14)*100)","v":""},{"$f":"SUM(H7:H13)","v":{"v":0,"d":"0.00"}},{"$f":"IF(($D14=0),\"\",(J14/$D14)*100)","v":""},{"$f":"SUM(J7:J13)","v":{"v":0,"d":"0.00"}},{"$f":"IF(($D14=0),\"\",(L14/$D14)*100)","v":""},{"$f":"SUM(L7:L13)","v":{"v":0,"d":"0.00"}},{"$f":"IF(($D14=0),\"\",(N14/$D14)*100)","v":""},{"$f":"SUM(N7:N13)","v":{"v":0,"d":"0.00"}}]
["Qualités techniques de l'offre","Adéquation des solutions techniques","R13*",null,null,{"$f":"IF(E15>0,E15*$D15/100*D$19/100,\"\")","v":""},null,{"$f":"IF(G15>0,G15*$D15/100*D$19/100,\"\")","v":""},null,{"$f":"IF(I15>0,I15*$D15/100*D$19/100,\"\")","v":""},null,{"$f":"IF(K15>0,K15*$D15/100*D$19/100,\"\")","v":""},null,{"$f":"IF(M15>0,M15*$D15/100*D$19/100,\"\")","v":""}]
[null,"Compréhension du cahier des charges","R14*",null,null,{"$f":"IF(E16>0,E16*$D16/100*D$19/100,\"\")","v":""},null,{"$f":"IF(G16>0,G16*$D16/100*D$19/100,\"\")","v":""},null,{"$f":"IF(I16>0,I16*$D16/100*D$19/100,\"\")","v":""},null,{"$f":"IF(K16>0,K16*$D16/100*D$19/100,\"\")","v":""},null,{"$f":"IF(M16>0,M16*$D16/100*D$19/100,\"\")","v":""}]
[null,"Analyse de sensibilité des prix unitaires","--",null,null,{"$f":"IF(E17>0,E17*$D17/100*D$19/100,\"\")","v":""},null,{"$f":"IF(G17>0,G17*$D17/100*D$19/100,\"\")","v":""},null,{"$f":"IF(I17>0,I17*$D17/100*D$19/100,\"\")","v":""},null,{"$f":"IF(K17>0,K17*$D17/100*D$19/100,\"\")","v":""},null,{"$f":"IF(M17>0,M17*$D17/100*D$19/100,\"\")","v":""}]
[null,"TOTAL DU SOUS CRITÈRE (100%)",null,{"$f":"IF(SUM(D15:D17)<>100,\"ERREUR\",SUM(D15:D17))","v":"ERREUR"},null,{"$f":"IF(E18>0,E18*$D18/100*D$19/100,\"\")","v":""},null,{"$f":"IF(G18>0,G18*$D18/100*D$19/100,\"\")","v":""},null,{"$f":"IF(I18>0,I18*$D18/100*D$19/100,\"\")","v":""},null,{"$f":"IF(K18>0,K18*$D18/100*D$19/100,\"\")","v":""},null,{"$f":"IF(M18>0,M18*$D18/100*D$19/100,\"\")","v":""}]
["Total critère tableau d'évaluation",null,null,{"$f":"'4. Tableau récap'!B11","v":{"v":0,"d":"0 %"}},{"$f":"IF(($D19=0),\"\",(F19/$D19)*100)","v":""},{"$f":"SUM(F15:F18)","v":{"v":0,"d":"0.00"}},{"$f":"IF(($D19=0),\"\",(H19/$D19)*100)","v":""},{"v":0,"d":"0.00"},{"$f":"IF(($D19=0),\"\",(J19/$D19)*100)","v":""},{"v":0,"d":"0.00"},{"$f":"IF(($D19=0),\"\",(L19/$D19)*100)","v":""},{"v":0,"d":"0.00"},{"$f":"IF(($D19=0),\"\",(N19/$D19)*100)","v":""},{"v":0,"d":"0.00"}]
["Organisation du soumissionnaire","Organisation qualité","Q1*",null,null,{"$f":"IF(E20>0,E20*$D20/100*D$26/100,\"\")","v":""},null,{"$f":"IF(G20>0,G20*$D20/100*D$26/100,\"\")","v":""},null,{"$f":"IF(I20>0,I20*$D20/100*D$26/100,\"\")","v":""},null,{"$f":"IF(K20>0,K20*$D20/100*D$26/100,\"\")","v":""},null,{"$f":"IF(M20>0,M20*$D20/100*D$26/100,\"\")","v":""}]
[null,"Organisation interne","Q2*",null,null,"",null,"",null,"",null,"",null,""]
[null,"Concept hygiène, santé, sécurité","Q3*",null,null,"",null,"",null,"",null,"",null,""]
[null,"Capacité en personnel","Q4*",null,null,"",null,"",null,"",null,"",null,""]
[null,"Contribution au développement durable (aspects environnementaux et sociaux)","Q5*",null,null,"",null,"",null,"",null,"",null,""]
[null,"TOTAL DU SOUS CRITÈRE (100%)",null,{"$f":"IF(SUM(D20:D24)<>100,\"ERREUR\",SUM(D20:D24))","v":"ERREUR"},null,"",null,"",null,"",null,"",null,""]
["Total critère tableau d'évaluation",null,null,{"$f":"'4. Tableau récap'!B12","v":{"v":0,"d":"0 %"}},{"$f":"IF(($D26=0),\"\",(F26/$D26)*100)","v":""},{"$f":"SUM(F20:F25)","v":{"v":0,"d":"0.00"}},{"$f":"IF(($D26=0),\"\",(H26/$D26)*100)","v":""},{"$f":"SUM(H20:H25)","v":{"v":0,"d":"0.00"}},{"$f":"IF(($D26=0),\"\",(J26/$D26)*100)","v":""},{"$f":"SUM(J20:J25)","v":{"v":0,"d":"0.00"}},{"$f":"IF(($D26=0),\"\",(L26/$D26)*100)","v":""},{"$f":"SUM(L20:L25)","v":{"v":0,"d":"0.00"}},{"$f":"IF(($D26=0),\"\",(N26/$D26)*100)","v":""},{"$f":"SUM(N20:N25)","v":{"v":0,"d":"0.00"}}]
["Références","Références","Q9*",null,null,{"$f":"IF(E27>0,E27*$D27/100*D$29/100,\"\")","v":""},null,{"$f":"IF(G27>0,G27*$D27/100*D$29/100,\"\")","v":""},null,{"$f":"IF(I27>0,I27*$D27/100*D$29/100,\"\")","v":""},null,{"$f":"IF(K27>0,K27*$D27/100*D$29/100,\"\")","v":""},null,{"$f":"IF(M27>0,M27*$D27/100*D$29/100,\"\")","v":""}]
[null,"TOTAL DU SOUS CRITÈRE (100%)",null,{"$f":"IF(D27<>100,\"ERREUR\",D27)","v":"ERREUR"},null,{"$f":"IF(E28>0,E28*$D28/100*D$29/100,\"\")","v":""},null,{"$f":"IF(G28>0,G28*$D28/100*D$29/100,\"\")","v":""},null,{"$f":"IF(I28>0,I28*$D28/100*D$29/100,\"\")","v":""},null,{"$f":"IF(K28>0,K28*$D28/100*F$29/100,\"\")","v":""},null,{"$f":"IF(M28>0,M28*$D28/100*H$29/100,\"\")","v":""}]
["Total critère tableau d'évaluation",null,null,{"$f":"'4. Tableau récap'!B13","v":{"v":0,"d":"0 %"}},{"$f":"IF(($D29=0),\"\",(F29/$D29)*100)","v":""},{"$f":"SUM(F27:F28)","v":{"v":0,"d":"0.00"}},{"$f":"IF(($D29=0),\"\",(H29/$D29)*100)","v":""},{"v":0,"d":"0.00"},{"$f":"IF(($D29=0),\"\",(J29/$D29)*100)","v":""},{"v":0,"d":"0.00"},{"$f":"IF(($D29=0),\"\",(L29/$D29)*100)","v":""},{"v":0,"d":"0.00"},{"$f":"IF(($D29=0),\"\",(N29/$D29)*100)","v":""},{"v":0,"d":"0.00"}]
[{"$f":"IF(#REF!>0,#REF!,\"Critère supplémentaire\")","v":{"$error":"#REF!"}},{"$f":"'4. Tableau récap'!A14","v":"…"},{"$nulls":3},{"$f":"IF(E30>0,E30*$D30/100*D$32/100,\"\")","v":""},null,{"$f":"IF(G30>0,G30*$D30/100*D$32/100,\"\")","v":""},null,{"$f":"IF(I30>0,I30*$D30/100*D$32/100,\"\")","v":""},null,{"$f":"IF(K30>0,K30*$D30/100*D$32/100,\"\")","v":""},null,{"$f":"IF(M30>0,M30*$D30/100*D$32/100,\"\")","v":""}]
[null,"TOTAL DU SOUS CRITÈRE (100%)",null,{"$f":"IF(D30<>100,\"ERREUR\",D30)","v":"ERREUR"},null,{"$f":"IF(E31>0,E31*$D31/100*D$32/100,\"\")","v":""},null,{"$f":"IF(G31>0,G31*$D31/100*F$32/100,\"\")","v":""},null,{"$f":"IF(I31>0,I31*$D31/100*H$32/100,\"\")","v":""},null,{"$f":"IF(K31>0,K31*$D31/100*J$32/100,\"\")","v":""},null,{"$f":"IF(M31>0,M31*$D31/100*L$32/100,\"\")","v":""}]
["Total critère tableau d'évaluation",null,null,{"$f":"'4. Tableau récap'!B14","v":{"v":0,"d":"0 %"}},{"$f":"IF(($D32=0),\"\",(F32/$D32)*100)","v":""},{"$f":"SUM(F30:F31)","v":{"v":0,"d":"0.00"}},{"$f":"IF(($D32=0),\"\",(H32/$D32)*100)","v":""},{"v":0,"d":"0.00"},{"$f":"IF(($D32=0),\"\",(J32/$D32)*100)","v":""},{"v":0,"d":"0.00"},{"$f":"IF(($D32=0),\"\",(L32/$D32)*100)","v":""},{"v":0,"d":"0.00"},{"$f":"IF(($D32=0),\"\",(N32/$D32)*100)","v":""},{"v":0,"d":"0.00"}]
[null,null,"*Annexes du Guide romand pour les marchés publics disponibles sur le site Internet officiel de l’État de Vaud"]
["Noms, prénoms :",{"$f":"'4. Tableau récap'!B18","v":0}]
["Signatures :"]
["Date :",{"$f":"'4. Tableau récap'!B20","v":"00:00:00"}]

{"sheet":"6. Avantage offre","index":5,"n_rows":9,"n_cols":2,"rows_kept":9,"merged":[[1,0,1,1]]}
[]
["Caractéristiques et avantages décisifs de l'offre retenue"]
[]
[null,"Justificatifs"]
["Nom soumissionnaire 1","Exemple : Avec le troisième prix déposé mais le nombre maximum de points dans tous les critères qualitatifs, A. SA totalise le plus grand nombre de points sur l’ensemble des critères évalués. L’organisation particulièrement performante mise en place pour l’exécution du marché dépasse nettement celle présentée par les autres soumissionnaires (critères x et x). Son expérience accumulée en matière de… a également été décisive pour l’adjudication"]
["Nom soumissionnaire 2","…"]
["Nom soumissionnaire 3","…"]
["Nom soumissionnaire 4","…"]
["Nom soumissionnaire 5","…"]

{"sheet":"7. Not prix","index":6,"n_rows":12,"n_cols":1,"rows_kept":12,"merged":[[1,0,1,5]]}
[]
["Méthode de notation du prix"]
[]
[]
[]
[]
[]
["PMin = offre la moins chère = note 5"]
["PMax = prix maximum (2 x Pmin) = note 0"]
["POffre = prix de l'offre à noter"]
[]
["Source : méthode de notation du prix adoptée par la Municipalité le 06.10.2010"]

{"sheet":"8. Aide not Q1-5","index":7,"n_rows":43,"n_cols":2,"rows_kept":43,"merged":[[1,0,1,21],[40,0,40,8],[42,1,42,3]]}
[]
["Annexe Q Critères d'aptitude* / Aide notes Q1 à Q5"]
{"$rows_empty":38}
["*Annexes du Guide romand pour les marchés publics disponibles sur le site Internet officiel de l’État de Vaud"]
[]
["Lien : ","Annexe Q Critères d'aptitude"]

{"sheet":"9. Aide not Q6-9","index":8,"n_rows":55,"n_cols":2,"rows_kept":55,"merged":[[1,0,1,22],[52,0,52,8],[54,1,54,3]]}
[]
["Annexe Q Critères d'aptitude* / Aide notes Q6 à Q9"]
{"$rows_empty":50}
["*Annexes du Guide romand pour les marchés publics disponibles sur le site Internet officiel de l’État de Vaud"]
[]
["Lien : ","Annexe Q Critères d'aptitude"]

{"sheet":"10. Aide not R5-9","index":9,"n_rows":54,"n_cols":2,"rows_kept":54,"merged":[[1,0,1,23],[51,0,51,8],[53,1,53,3]]}
[]
["Annexe R Critères d'adjudication* / Aide notes R5 à R9"]
{"$rows_empty":49}
["*Annexes du Guide romand pour les marchés publics disponibles sur le site Internet officiel de l’État de Vaud"]
[]
["Lien : ","Annexe R Critères d'adjudication"]

{"sheet":"11. Aide not R13-14","index":10,"n_rows":26,"n_cols":2,"rows_kept":26,"merged":[[1,0,1,21],[23,0,23,8],[25,1,25,3]]}
[]
["Annexe R Critères d'adjudication* / Aide notes R13 à R14"]
{"$rows_empty":21}
["*Annexes du Guide romand pour les marchés publics disponibles sur le site Internet officiel de l’État de Vaud"]
[]
["Lien : ","Annexe R Critères d'adjudication"]

{"sheet":"12. Critère concordance","index":11,"n_rows":2,"n_cols":1,"rows_kept":2,"merged":[[1,0,1,7]]}
[]
["Critère qualité technique de l'offre - sous-critère concordance des prix"]

{"sheet":"13. Liste critères","index":12,"n_rows":27,"n_cols":6,"rows_kept":27,"merged":[[1,0,1,4],[4,2,9,2],[10,2,13,2],[14,2,19,2],[20,2,21,2],[22,2,23,2],[24,0,24,4]]}
[]
["Liste des critères"]
[]
["Critères",null,null,"Sous-critères","Annexes à l'offre*","Lien"]
["Prix",null,"Organisation pour l'exécution du marché","Nombre de personnes","R6*","Annexe R6 - Nombre, planification et disponibilité des moyens et des ressources pour l’exécution du marché*"]
["Organisation pour l'exécution du marché",null,null,"Matériel mis à disposition","R6*","Annexe R6 - Nombre, planification et disponibilité des moyens et des ressources pour l’exécution du marché*"]
["Qualités techniques de l'offre",null,null,"Planning","R6*","Annexe R6 - Nombre, planification et disponibilité des moyens et des ressources pour l’exécution du marché*"]
["Organisation du soumissionnaire",null,null,"Méthodes","R7*","Annexe R7 - Méthodes de travail pour atteindre les objectifs fixés en matière d’exécution du marché*"]
["Références",null,null,"Tâches et responsabilités (qualification des personnes clés)","R8*","Annexe R8 - Répartition des tâches et des responsabilités pour l’exécution du marché*"]
["…",null,null,"…"]
[null,null,"Qualités techniques de l'offre","Adéquation des solutions techniques","R13*","Annexe R13 - Qualités des solutions techniques proposées pour l'exécution du marché*"]
[{"$nulls":3},"Compréhension du cahier des charges","R14*","Annexe R14 - Degré de compréhension du cahier des charges et des prestations à exécuter*"]
[{"$nulls":3},"Analyse de sensibilité des prix unitaires"]
[{"$nulls":3},"…"]
[null,null,"Organisation du soumissionnaire","Organisation qualité : certification officielle ou interne","Q1*","Annexe Q1 - Organisation qualité du soumissionnaire pour satisfaire les exigences du client*"]
[{"$nulls":3},"Organisation qualité : organisation interne","Q2*","Annexe Q2 - Organisation interne du soumissionnaire*"]
[{"$nulls":3},"Organisation qualité : plan hygiène, santé, sécurité","Q3*","Annexe Q3 - Concept santé, hygiène et sécurité au travail de l’entreprise*"]
[{"$nulls":3},"Organisation qualité : capacité en personnel","Q4*","Annexe Q4 - Capacité en personnel et formation de base des personnes-clés*"]
[{"$nulls":3},"Contribution de l'entreprise au développement durable (aspects environnementaux et sociaux)","Q5*","Annexe Q5 - Contribution de l'entreprise au développement durable (aspects environnementaux et sociaux)*"]
[{"$nulls":3},"…"]
[null,null,"Réf.","Références (services)","Q6*","Annexe Q6 - Références de services liés à la construction*"]
[{"$nulls":3},"Références (travaux de construction)","Q9*","Annexe Q9 - Références de travaux de construction*"]
[null,null,{"$f":"IF(A10>0,A10,\"\")","v":"…"},"…"]
[{"$nulls":3},"…"]
["*Annexes du Guide romand pour les marchés publics disponibles sur le site Internet officiel de l’État de Vaud"]
[{"$nulls":5},"Annexe Q Critères d'aptitude*"]
[{"$nulls":5},"Annexe R Critères d'adjudication*"]